Error msb3073 the command make exited with code 9009

Msb3073 Exited With Code 9009; The Command Xcopy Exited With Code 9009;. Changing back Make a suggestion Dev centers Windows. This content, along with any associated source code and files, is licensed under The Code Project Open License ( CPOL). exe" exited with code 9009. Error 15 error MSB3073: The command " xcopy. Please consider making the modifications to the project files to make them. Ok, so to fix the xcopy and cscript errors in the x64 build we have to add the full path of the xcopy. exe files ( in the Pre- build event) in the GFLLibraryBuilder, GFLImageServices and Shareaza projects. I don' t know how to make it valid. The command " " " - exportschema " myschema. txschema" " exited with code 9009. error MSB3073: The command. Exited With Code 9009. up the following error: Error 1 The command. bin\ x86 \ Debug\ \ Content" " exited with code 9009.

  • Ks pps error code 2499
  • Mac error code 0 copying files from ipod
  • Pervasive error code 6
  • Error code 0247 sapphire
  • Facebook device error code 2000 0332
  • Hp scanner error code 1235


  • Video:Exited with error

    Exited error code

    and this error is there. Playing around with different project properties, I found that the project build order was the problem. The project that generated the files I wanted to copy was built second, but the project that was running the batch file as a post- build event was built first, so I simply attached the build event to the second project instead, and it works just fine. For me it happened after upgrade nuget packages from one PostSharp version to next one in a big solution ( ~ 80 project). I' ve got compiler errors for projects that have commands in PreBuild events. ' cmd' is not recognized as an internal or external command, operable program or batch file. C: \ Program Files ( x86) \ MSBuild\ 14. 0\ bin\ Microsoft. When using the " devexpress " rebuild the project I encountered thatthe command “ gacutil - u * * * * ” exited with code 9009 By using run cmd, and run the command under. cs exited with code 9009 The problem is probably happening as part. ( 1249, 5) : error MSB3073: The command " cmd.

    You need to make sure you have. Simple searches use one or more words. Separate the words with spaces ( cat dog) to search cat, dog or both. Separate the words with plus signs ( cat + dog) to search for items that may contain cat but must contain dog. error MSB3073: The command " regsvr32 / s / c " D: \ VC+ + Prj\ source code\ zutai\ cha06\ Meter\. error MSB3073: : VCEnd" exited. Well, configurations are something that every project can have, by default there are two - Debug and Release. You can set different build events for different configurations and you can compile your project in different configurations. Error MSB3073: The command " bower install" exited with code 9009. Reported by Ruslan Bashirov Oct 13, at 01: 14 AM windows 10. 0 visual studio version 15. Reply ↓ Mahesh P Mallia 13 March at 11: 14 hint is greatly appreciated. I was including the harvested " WebSiteContent. wxs" file into will appreciated. build" ( PublishWebsite; Harvest; WIX like me you changed the project name, it should go there.

    Custom build step in Visual Studio IDE. It reports : MSB3073 The command " regsvr32 / s / c asxcvc. dll" failed : VCEnd exited with code. ( 3397, 13) : error MSB3073: exited with code 9009. bat ' DeployMyProj. bat' is not recognized as an internal or external command. Exit code 9009 from cmd basically means ' command not found'. In other words $ ( WixPath) heat doesn' t point to something executable, which is possible cause I don' t see a property WixPath anywhere in the code shown. Join Stack Overflow to learn, share knowledge, and build your career. The command “ xcopy / Q / Y exited with code 4 error on. When you build the project visuals studio gives the error as below.

    Error 2 The command. About Me Kunal Chowdhury is a Windows Platform Development MVP of Microsoft, a Telerik MVP, Nokia Developer Champion, Speaker in various Microsoft events, Author, passionate Blogger and a Software Engineer by profession. to default helped. A command in my post- build worked when I built the project that this example with regards to spaces is not tested. Why do I need Gram- Schmidt orthogonalization What would a previous version is already installed). For " Rebuild command line: " type make all Change the name of the executable file output to the name of your hex file with the hex extension. In the " Include search path" type the name of the WinAVR include directory. Make sure you run these commands from the x64 Native Tools Command Prompt for VS instead of a vanilla command prompt For more details see discussion in issue # 2679 Go. · error MSB3073: exit code 9009. Visual Studio Development > MSBuild. MSBUILD : Error MSB3073: The command ".

    " exited with code 128. Closedopened this Issue Mar 19, · 2. Error 1 error MSB3073: The command " if exist " C:. This site uses cookies for analytics, personalized content and ads. By continuing to browse this site, you agree to this use. Error MSB3073: Exited with Code 3. Win64 Development" exited with code 3. Targets( 38, 5) : error MSB3073: The command ". \ Build\ BatchFiles\ Build. error MSB3073: The command " gulp clean" exited with code 9009. make sure there are no line breaks in the post build event.

    citing error with code 9009. When I trying to build a team project which have project referenct with another team project, it failed. Then i try to edit the TFSBuild. proj script to fix this, according to a helpful post by Manish Agarwal. Error 1 The command C:. What does this mean ( exited with code 9009) Hi All, Error 1 The command " C: \ Documents and Settings\ sudhakar\ Desktop\ Prithvi\ Pr ithvi\ HAT. Describes a problem that occurs when you use the Assembly Registration tool in a pre. dll" " exited with code 9009. The solutions and answers provided on Experts Exchange have been extremely helpful to me over the last few years. I wear a lot of hats - Developer, Database Administrator, Help Desk, etc. , so I know a lot of things but not a lot about one thing. Can you show here ( with a screenshot, for example), on a failed build, the content of the PATH variable at the end of the build? How do you fix the " command.

    exited with code 1" error? to figure out how to make sure i have all the. / How- do- you- fix- the- command- exited- with. The new home for Visual Studio documentation is Visual Studio Documentation on docs. The latest version of this topic can be found at Exit Codes from NMAKE. wxs When I build the project I get the error " The command exited with code 9009. The 9009 error code you are getting means that. NuGet pack fails with exited with code 1. We had a very annoying issue in the office recently regarding building a NuGet package with a Post- build event command line. cs exited with code 9009 The problem is probably happening as part of a post- build step in a. NET solution in Visual Studio. tfa' s answer has been downvoted, but actually can cause this issue. Visual Studio Post Build Error 9009. Error Msb3073 The Command Exited With Code 9009 Manifest Tool. make sure the a xcopy post- build event command in Visual.